BDBM4736 4,6-diamino-5-methanesulfonamidopyridine-2-carboxylic acid::pyridine deriv. 48
SMILES CS(=O)(=O)Nc1c(N)cc(nc1N)C(O)=O
InChI Key InChIKey=HGVYBQLODWERBT-UHFFFAOYSA-N
Data  1 IC50
  Tab Delimited (TSV)   2D SDfile   Computed 3D by Vconf -m prep SDfile
Find this compound or compounds like it in BindingDB:
Activity Spreadsheet -- Enzyme Inhibition Constant Data from BindingDB
Found 1 hit for monomerid = 4736
TargetNeuraminidase(Influenza A virus (N9))
Biocryst Pharmaceuticals
LigandPNGBDBM4736(4,6-diamino-5-methanesulfonamidopyridine-2-carboxy...)
Affinity DataIC50:  1.00E+6nMpH: 6.5 T: 2°C. Assay description: A standard fluorimetric assay was used to measure influenza virus neuraminidase activity. The substrate 2 -(4-methylumbelliferyl)-alpha-D-acetylneura...
Ligand InfoPC cidPC sid
In DepthDetails ArticlePubMed