BDBM47370 BDBM50434858::US9040518, 26
SMILES CCCC[C@]1(CC)CS(=O)(=O)c2cc(CNC(CC(O)=O)CC(O)=O)c(OC)cc2[C@H](N1)c1ccccc1
InChI Key InChIKey=CZGVOBIGEBDYTP-VSGBNLITSA-N
Data  4 IC50
  Tab Delimited (TSV)   2D SDfile   Computed 3D by Vconf -m prep SDfile
Find this compound or compounds like it in BindingDB:
Activity Spreadsheet -- Enzyme Inhibition Constant Data from BindingDB
Found 4 hits for monomerid = 47370
TargetIleal sodium/bile acid cotransporter(Homo sapiens (Human))
Glaxosmithkline
US Patent
LigandPNGBDBM47370(BDBM50434858 | US9040518, 26)
Affinity DataIC50:  43nMT: 2°C. Assay description: On the day of the uptake experiment, 10 mM HEPES was added to Hank's Balanced Salt Solution, and the pH was adjusted to 7.4 with TRIS (HBSSH). The as...
In DepthDetails US Patent
TargetIleal sodium/bile acid cotransporter(Mus musculus)
Glaxosmithkline
Curated by ChEMBL
LigandPNGBDBM47370(BDBM50434858 | US9040518, 26)
Affinity DataIC50:  2.10nM. Assay description: Inhibition of mouse ASBT expressed in HEK293 cells assessed as inhibition of [3H]-taurocholate uptake after 90 mins by scintillation counting analysi...
In DepthDetails ArticlePubMed
TargetIleal sodium/bile acid cotransporter(Rattus norvegicus)
Glaxosmithkline
Curated by ChEMBL
LigandPNGBDBM47370(BDBM50434858 | US9040518, 26)
Affinity DataIC50:  1.90nM. Assay description: Inhibition of rat ASBT expressed in HEK293 cells assessed as inhibition of [3H]-taurocholate uptake after 90 mins by scintillation counting analysis
In DepthDetails ArticlePubMed
TargetIleal sodium/bile acid cotransporter(Homo sapiens (Human))
Glaxosmithkline
US Patent
LigandPNGBDBM47370(BDBM50434858 | US9040518, 26)
Affinity DataIC50:  42nM. Assay description: Inhibition of human ASBT expressed in HEK293 cells assessed as inhibition of [3H]-taurocholate uptake after 90 mins by scintillation counting analysi...
In DepthDetails ArticlePubMed