BDBM47388 3-chloranyl-N-[2-chloranyl-5-(trifluoromethyl)phenyl]-6-(3,5-dimethylpyrazol-1-yl)pyridine-2-carboxamide::3-chloro-N-[2-chloro-5-(trifluoromethyl)phenyl]-6-(3,5-dimethyl-1-pyrazolyl)-2-pyridinecarboxamide::3-chloro-N-[2-chloro-5-(trifluoromethyl)phenyl]-6-(3,5-dimethylpyrazol-1-yl)picolinamide::3-chloro-N-[2-chloro-5-(trifluoromethyl)phenyl]-6-(3,5-dimethylpyrazol-1-yl)pyridine-2-carboxamide::UNM000011098501::cid_2401094
SMILES Cc1cc(C)n(n1)-c1ccc(Cl)c(n1)C(=O)Nc1cc(ccc1Cl)C(F)(F)F
InChI Key InChIKey=KSXWBLCIUPCRJR-UHFFFAOYSA-N
Data  1 IC50  1 EC50
  Tab Delimited (TSV)   2D SDfile   Computed 3D by Vconf -m prep SDfile
Find this compound or compounds like it in BindingDB:
Activity Spreadsheet -- Enzyme Inhibition Constant Data from BindingDB
Found 2 hits for monomerid = 47388
TargetPlectin(Homo sapiens (Human))
Burnham Center For Chemical Genomics
Curated by PubChem BioAssay
LigandPNGBDBM47388(3-chloranyl-N-[2-chloranyl-5-(trifluoromethyl)phen...)
Affinity DataIC50:  2.00E+5nM. Assay description: Data Source: Sanford-Burnham Center for Chemical Genomics (SBCCG) Source Affiliation: Sanford-Burnham Medical Research Institute (SBMRI, San Diego, C...
Ligand InfoPC cidPC sid
In DepthDetails PCBioAssay
LigandPNGBDBM47388(3-chloranyl-N-[2-chloranyl-5-(trifluoromethyl)phen...)
Affinity DataEC50:  240nM. Assay description: University of New Mexico Assay Overview: Assay Support:1R03MH081228-01A1 High-throughput multiplex screening for ABC transporter inhibitors PI: Rich...
Ligand InfoPC cidPC sid
In DepthDetails PCBioAssay