BDBM47393 2-[[4-chloranyl-6-[(4-nitrophenyl)amino]-1,3,5-triazin-2-yl]amino]ethanol::2-[[4-chloro-6-(4-nitroanilino)-1,3,5-triazin-2-yl]amino]ethanol::2-[[4-chloro-6-(4-nitroanilino)-s-triazin-2-yl]amino]ethanol::UNM000011099901::cid_3134434
SMILES OCCNc1nc(Cl)nc(Nc2ccc(cc2)[N+]([O-])=O)n1
InChI Key InChIKey=PMFOFPSTSTXUIC-UHFFFAOYSA-N
Data  1 EC50
  Tab Delimited (TSV)   2D SDfile   Computed 3D by Vconf -m prep SDfile
Find this compound or compounds like it in BindingDB:
Activity Spreadsheet -- Enzyme Inhibition Constant Data from BindingDB
Found 1 hit for monomerid = 47393
LigandPNGBDBM47393(2-[[4-chloranyl-6-[(4-nitrophenyl)amino]-1,3,5-tri...)
Affinity DataEC50:  4.63E+3nM. Assay description: University of New Mexico Assay Overview: Assay Support:1R03MH081228-01A1 High-throughput multiplex screening for ABC transporter inhibitors PI: Rich...
In DepthDetails PCBioAssay