BDBM4745 (3S,4S)-3-carbamimidamido-4-[(S)-acetamido[(4-methylpentan-2-yl)carbamoyl]methyl]cyclopentane-1-carboxylic acid::Cyclopentane Amide deriv. 14h
SMILES [#6]-[#6](-[#6])-[#6]-[#6](-[#6])-[#7]-[#6](=O)-[#6](-[#7]-[#6](-[#6])=O)-[#6@H]-1-[#6]-[#6](-[#6]-[#6@@H]-1\[#7]=[#6](\[#7])-[#7])-[#6](-[#8])=O
InChI Key InChIKey=AMCMLLSUYOREQT-UOKOURQSSA-N
Data  2 IC50
  Tab Delimited (TSV)   2D SDfile   Computed 3D by Vconf -m prep SDfile
Find this compound or compounds like it in BindingDB:
Activity Spreadsheet -- Enzyme Inhibition Constant Data from BindingDB
Found 2 hits for monomerid = 4745
TargetNeuraminidase(Influenza B virus (B/Lee/40))
Biocryst Pharmaceuticals
LigandPNGBDBM4745((3S,4S)-3-carbamimidamido-4-[(S)-acetamido[(4-meth...)
Affinity DataIC50:  1.14E+4nM. Assay description: A standard fluorimetric assay was used to measure influenza virus neuraminidase activity. The substrate 2 -(4-methylumbelliferyl)-alpha-D-acetylneura...
In DepthDetails ArticlePubMed
TargetNeuraminidase(Influenza A virus (N9))
Biocryst Pharmaceuticals
LigandPNGBDBM4745((3S,4S)-3-carbamimidamido-4-[(S)-acetamido[(4-meth...)
Affinity DataIC50:  8.40E+3nMpH: 6.5 T: 2°C. Assay description: A standard fluorimetric assay was used to measure influenza virus neuraminidase activity. The substrate 2 -(4-methylumbelliferyl)-alpha-D-acetylneura...
In DepthDetails ArticlePubMed