BDBM47541 1-(2-chlorophenyl)-3-(2-pyridinyl)thiourea::1-(2-chlorophenyl)-3-(2-pyridyl)thiourea::1-(2-chlorophenyl)-3-(pyridin-2-yl)thiourea::1-(2-chlorophenyl)-3-pyridin-2-yl-thiourea::1-(2-chlorophenyl)-3-pyridin-2-ylthiourea::CHEMBL1253185::MLS000665964::N-(2-chlorophenyl)-N'-2-pyridinylthiourea::SMR000294655::cid_972361
SMILES Clc1ccccc1NC(=S)Nc1ccccn1
InChI Key InChIKey=ZRDDWFAJQXEXAI-UHFFFAOYSA-N
Data  2 IC50  1 EC50
  Tab Delimited (TSV)   2D SDfile   Computed 3D by Vconf -m prep SDfile
Find this compound or compounds like it in BindingDB:
Activity Spreadsheet -- Enzyme Inhibition Constant Data from BindingDB
Found 3 hits for monomerid = 47541
TargetSolute carrier family 12 member 5(Homo sapiens (Human))
Vanderbilt Screening Center For Gpcrs, Ion Channels And Transporters
Curated by PubChem BioAssay
LigandPNGBDBM47541(1-(2-chlorophenyl)-3-(2-pyridinyl)thiourea | 1-(2-...)
Affinity DataEC50:  1.97E+3nM. Assay description: Vanderbilt Screening Center for GPCRs, Ion Channels and Transporters Assay Provider: Eric Delpire Assay Provider Affliation: Vanderbilt University Gr...
In DepthDetails PCBioAssay
TargetMacrophage migration inhibitory factor(Homo sapiens (Human))
Brain Mind Institute
Curated by ChEMBL
LigandPNGBDBM47541(1-(2-chlorophenyl)-3-(2-pyridinyl)thiourea | 1-(2-...)
Affinity DataIC50:  1.01E+3nM. Assay description: Inhibition of human MIF tautomerase activity in presence of Triton X-100 as detergent
In DepthDetails ArticlePubMed
TargetMacrophage migration inhibitory factor(Homo sapiens (Human))
Brain Mind Institute
Curated by ChEMBL
LigandPNGBDBM47541(1-(2-chlorophenyl)-3-(2-pyridinyl)thiourea | 1-(2-...)
Affinity DataIC50:  1.04E+3nM. Assay description: Inhibition of human MIF tautomerase activity
In DepthDetails ArticlePubMed