BDBM47725 2-(2,5-diketo-4,4-dimethyl-imidazolidin-1-yl)-N-[4-(4-fluorophenyl)thiazol-2-yl]acetamide::2-(4,4-dimethyl-2,5-dioxo-1-imidazolidinyl)-N-[4-(4-fluorophenyl)-2-thiazolyl]acetamide::2-(4,4-dimethyl-2,5-dioxoimidazolidin-1-yl)-N-[4-(4-fluorophenyl)-1,3-thiazol-2-yl]acetamide::2-[4,4-dimethyl-2,5-bis(oxidanylidene)imidazolidin-1-yl]-N-[4-(4-fluorophenyl)-1,3-thiazol-2-yl]ethanamide::MLS000565157::SMR000152370::cid_2461966
SMILES CC1(C)NC(=O)N(CC(=O)Nc2nc(cs2)-c2ccc(F)cc2)C1=O
InChI Key InChIKey=ZHSAYPAWIHIVJD-UHFFFAOYSA-N
Data  5 EC50
  Tab Delimited (TSV)   2D SDfile   Computed 3D by Vconf -m prep SDfile
Find this compound or compounds like it in BindingDB:
Activity Spreadsheet -- Enzyme Inhibition Constant Data from BindingDB
Found 5 hits for monomerid = 47725
TargetRegulator of G-protein signaling 7(Homo sapiens (Human))
Nmmlsc
Curated by PubChem BioAssay
LigandPNGBDBM47725(2-(2,5-diketo-4,4-dimethyl-imidazolidin-1-yl)-N-[4...)
Affinity DataEC50: >3.00E+4nM. Assay description: University of New Mexico Assay Overview: Assay Support: NIH R21NS057014 HTS to identify small molecule regulators of RGS family protein interaction...
In DepthDetails PCBioAssay
TargetRegulator of G-protein signaling 19(Homo sapiens (Human))
Nmmlsc
Curated by PubChem BioAssay
LigandPNGBDBM47725(2-(2,5-diketo-4,4-dimethyl-imidazolidin-1-yl)-N-[4...)
Affinity DataEC50: >3.00E+4nM. Assay description: University of New Mexico Assay Overview: Assay Support: NIH R21NS057014 HTS to identify small molecule regulators of RGS family protein interaction...
In DepthDetails PCBioAssay
TargetRegulator of G-protein signaling 4(Homo sapiens (Human))
Nmmlsc
Curated by PubChem BioAssay
LigandPNGBDBM47725(2-(2,5-diketo-4,4-dimethyl-imidazolidin-1-yl)-N-[4...)
Affinity DataEC50:  3.00E+4nM. Assay description: University of New Mexico Assay Overview: Assay Support: NIH R21NS057014 HTS to identify small molecule regulators of RGS family protein interaction...
In DepthDetails PCBioAssay
TargetRegulator of G-protein signaling 8(Homo sapiens (Human))
Nmmlsc
Curated by PubChem BioAssay
LigandPNGBDBM47725(2-(2,5-diketo-4,4-dimethyl-imidazolidin-1-yl)-N-[4...)
Affinity DataEC50: >3.00E+4nM. Assay description: University of New Mexico Assay Overview: Assay Support: NIH R21NS057014 HTS to identify small molecule regulators of RGS family protein interaction...
In DepthDetails PCBioAssay
TargetRegulator of G-protein signaling 16(Homo sapiens (Human))
Nmmlsc
Curated by PubChem BioAssay
LigandPNGBDBM47725(2-(2,5-diketo-4,4-dimethyl-imidazolidin-1-yl)-N-[4...)
Affinity DataEC50: >3.00E+4nM. Assay description: University of New Mexico Assay Overview: Assay Support: NIH R21NS057014 HTS to identify small molecule regulators of RGS family protein interaction...
In DepthDetails PCBioAssay