BDBM48053 3-amino-4,6-dimethyl-N-[4-(trifluoromethoxy)benzyl]thieno[2,3-b]pyridine-2-carboxamide::3-amino-4,6-dimethyl-N-[[4-(trifluoromethoxy)phenyl]methyl]-2-thieno[2,3-b]pyridinecarboxamide::3-amino-4,6-dimethyl-N-[[4-(trifluoromethoxy)phenyl]methyl]thieno[2,3-b]pyridine-2-carboxamide::3-azanyl-4,6-dimethyl-N-[[4-(trifluoromethyloxy)phenyl]methyl]thieno[2,3-b]pyridine-2-carboxamide::VU0402480-1::cid_44176131
SMILES Cc1cc(C)c2c(N)c(sc2n1)C(=O)NCc1ccc(OC(F)(F)F)cc1
InChI Key InChIKey=MJVWPSGVRPHCIG-UHFFFAOYSA-N
Data  1 EC50
  Tab Delimited (TSV)   2D SDfile   Computed 3D by Vconf -m prep SDfile
Find this compound or compounds like it in BindingDB:
Activity Spreadsheet -- Enzyme Inhibition Constant Data from BindingDB
Found 1 hit for monomerid = 48053
TargetMuscarinic acetylcholine receptor M4(RAT)
Vanderbilt Screening Center For Gpcrs, Ion Channels And Transporters
Curated by PubChem BioAssay
LigandPNGBDBM48053(3-amino-4,6-dimethyl-N-[4-(trifluoromethoxy)benzyl...)
Affinity DataEC50:  0.00506nM. Assay description: Assay Provider: Colleen Niswender Assay Provider Affiliation: Vanderbilt University Grant Title: Discovery of a Highly Selective in vitro and in vivo...
In DepthDetails PCBioAssay