BDBM48100 MLS000737026::N-[(Z)-(4-methyl-5-phenyldiazenyl-2-imidazolylidene)amino]aniline::N-[(Z)-(4-methyl-5-phenyldiazenyl-imidazol-2-ylidene)amino]aniline::N-[(Z)-(4-methyl-5-phenyldiazenylimidazol-2-ylidene)amino]aniline::SMR000393982::[(Z)-(4-methyl-5-phenylazo-imidazol-2-ylidene)amino]-phenyl-amine::cid_6076775
SMILES Cc1[nH]c(N=Nc2ccccc2)nc1N=Nc1ccccc1
InChI Key InChIKey=JLRWIRBFDUKCMN-UHFFFAOYSA-N
Data  1 IC50  2 EC50
  Tab Delimited (TSV)   2D SDfile   Computed 3D by Vconf -m prep SDfile
Find this compound or compounds like it in BindingDB:
Activity Spreadsheet -- Enzyme Inhibition Constant Data from BindingDB
Found 3 hits for monomerid = 48100
TargetBeta-galactosidase(Escherichia coli)
Burnham Center For Chemical Genomics
Curated by PubChem BioAssay
LigandPNGBDBM48100(MLS000737026 | N-[(Z)-(4-methyl-5-phenyldiazenyl-2...)
Affinity DataEC50:  1.75E+4nM. Assay description: Data Source: Sanford-Burnham Center for Chemical Genomics (SBCCG) Source Affiliation: Sanford-Burnham Medical Research Institute (SBMRI, San Diego, C...
Ligand InfoPC cidPC sid
In DepthDetails PCBioAssay
TargetKappa-type opioid receptor(Homo sapiens (Human))
Burnham Center For Chemical Genomics
Curated by PubChem BioAssay
LigandPNGBDBM48100(MLS000737026 | N-[(Z)-(4-methyl-5-phenyldiazenyl-2...)
Affinity DataIC50:  8.40E+3nM. Assay description: Data Source: Sanford-Burnham Center for Chemical Genomics (SBCCG) Source Affiliation: Sanford-Burnham Medical Research Institute (SBMRI, San Diego, C...
Ligand InfoPC cidPC sid
In DepthDetails PCBioAssay
TargetStreptokinase A(Streptococcus pyogenes M1 GAS)
Broad Institute
Curated by PubChem BioAssay
LigandPNGBDBM48100(MLS000737026 | N-[(Z)-(4-methyl-5-phenyldiazenyl-2...)
Affinity DataEC50:  2.34E+4nM. Assay description: Keywords: Group A streptococcus, GAS, streptokinase, expression, virulence, inhibition, dose response, EC50 Assay Overview: The goal of this assa...
Ligand InfoPC cidPC sid
In DepthDetails PCBioAssay