BDBM48131 1H-indazole-3-carboxylic acid [2-keto-2-(1,2,5-trimethylpyrrol-3-yl)ethyl] ester::1H-indazole-3-carboxylic acid [2-oxo-2-(1,2,5-trimethyl-3-pyrrolyl)ethyl] ester::MLS000058395::SMR000064062::[2-oxidanylidene-2-(1,2,5-trimethylpyrrol-3-yl)ethyl] 1H-indazole-3-carboxylate::[2-oxo-2-(1,2,5-trimethylpyrrol-3-yl)ethyl] 1H-indazole-3-carboxylate::cid_2084400
SMILES Cc1cc(C(=O)COC(=O)c2n[nH]c3ccccc23)c(C)n1C
InChI Key InChIKey=YHVQQQWCCMOXII-UHFFFAOYSA-N
Data  1 IC50  1 EC50
  Tab Delimited (TSV)   2D SDfile   Computed 3D by Vconf -m prep SDfile
Find this compound or compounds like it in BindingDB:
Activity Spreadsheet -- Enzyme Inhibition Constant Data from BindingDB
Found 2 hits for monomerid = 48131
TargetADP-ribosylation factor GTPase-activating protein 1(Rattus norvegicus)
The Scripps Research Institute Molecular Screening Center
Curated by PubChem BioAssay
LigandPNGBDBM48131(1H-indazole-3-carboxylic acid [2-keto-2-(1,2,5-tri...)
Affinity DataIC50:  3.24E+4nM
In DepthDetails PCBioAssay
TargetMatrix metalloproteinase-14 [1-36](Homo sapiens (Human))
Sanford-Burnham Center For Chemical Genomics
Curated by PubChem BioAssay
LigandPNGBDBM48131(1H-indazole-3-carboxylic acid [2-keto-2-(1,2,5-tri...)
Affinity DataEC50:  7.21E+3nM. Assay description: Data Source: Sanford-Burnham Center for Chemical Genomics (SBCCG) Source Affiliation: Sanford-Burnham Medical Research Institute (SBMRI, San Diego, C...
In DepthDetails PCBioAssay