BDBM48199 3-Amino-4,6-dimethyl-thieno[2,3-b]pyridine-2-carboxylic acid (5-methyl-thiazol-2-yl)-amide::3-amino-4,6-dimethyl-N-(5-methyl-1,3-thiazol-2-yl)thieno[2,3-b]pyridine-2-carboxamide::3-amino-4,6-dimethyl-N-(5-methyl-2-thiazolyl)-2-thieno[2,3-b]pyridinecarboxamide::3-amino-4,6-dimethyl-N-(5-methylthiazol-2-yl)thieno[2,3-b]pyridine-2-carboxamide::3-azanyl-4,6-dimethyl-N-(5-methyl-1,3-thiazol-2-yl)thieno[2,3-b]pyridine-2-carboxamide::MLS000120989::SMR000118402::cid_866034
SMILES Cc1cnc(NC(=O)c2sc3nc(C)cc(C)c3c2N)s1
InChI Key InChIKey=GCLBEAOIOHIRFO-UHFFFAOYSA-N
Data  1 EC50
  Tab Delimited (TSV)   2D SDfile   Computed 3D by Vconf -m prep SDfile
Find this compound or compounds like it in BindingDB:
Activity Spreadsheet -- Enzyme Inhibition Constant Data from BindingDB
Found 1 hit for monomerid = 48199
TargetMatrix metalloproteinase-14 [1-36](Homo sapiens (Human))
Sanford-Burnham Center For Chemical Genomics
Curated by PubChem BioAssay
LigandPNGBDBM48199(3-Amino-4,6-dimethyl-thieno[2,3-b]pyridine-2-carbo...)
Affinity DataEC50:  210nM. Assay description: Data Source: Sanford-Burnham Center for Chemical Genomics (SBCCG) Source Affiliation: Sanford-Burnham Medical Research Institute (SBMRI, San Diego, C...
In DepthDetails PCBioAssay