BDBM48794 3-(4-fluorophenyl)-1-[2-(2-methyl-1-piperidinyl)-2-oxoethyl]thieno[3,2-d]pyrimidine-2,4-dione::3-(4-fluorophenyl)-1-[2-(2-methylpiperidin-1-yl)-2-oxidanylidene-ethyl]thieno[3,2-d]pyrimidine-2,4-dione::3-(4-fluorophenyl)-1-[2-(2-methylpiperidin-1-yl)-2-oxoethyl]thieno[3,2-d]pyrimidine-2,4(1H,3H)-dione::3-(4-fluorophenyl)-1-[2-(2-methylpiperidin-1-yl)-2-oxoethyl]thieno[3,2-d]pyrimidine-2,4-dione::3-(4-fluorophenyl)-1-[2-keto-2-(2-methylpiperidino)ethyl]thieno[3,2-d]pyrimidine-2,4-quinone::MLS000730326::SMR000308602::cid_6619317
SMILES CC1CCCCN1C(=O)Cn1c2ccsc2c(=O)n(-c2ccc(F)cc2)c1=O
InChI Key InChIKey=OIWLYBAFTKBSQA-UHFFFAOYSA-N
Data  1 IC50
  Tab Delimited (TSV)   2D SDfile   Computed 3D by Vconf -m prep SDfile
Find this compound or compounds like it in BindingDB:
Activity Spreadsheet -- Enzyme Inhibition Constant Data from BindingDB
Found 1 hit for monomerid = 48794
TargetEukaryotic translation initiation factor 4 gamma 1(Homo sapiens (Human))
Emory University
Curated by PubChem BioAssay
LigandPNGBDBM48794(3-(4-fluorophenyl)-1-[2-(2-methyl-1-piperidinyl)-2...)
Affinity DataIC50:  5.00E+4nM. Assay description: Dose Response Confirmation for Small Molecule Inhibitors of Eukaryotic Translation Initiation NIH Molecular Libraries Screening Centers Network [MLSC...
In DepthDetails PCBioAssay