BDBM490 (2S)-N-[(2S,3R)-4-[benzyl(tert-butylcarbamoyl)amino]-3-hydroxy-1-phenylbutan-2-yl]-2-(quinolin-2-ylformamido)butanediamide::(Hydroxyethyl)urea Isostere deriv. 18
SMILES CC(C)(C)NC(=O)N(C[C@@H](O)[C@H](Cc1ccccc1)NC(=O)[C@H](CC(N)=O)NC(=O)c1ccc2ccccc2n1)Cc1ccccc1
InChI Key InChIKey=DEBMANAPOANQRD-RWSKJCERSA-N
Data  2 IC50
  Tab Delimited (TSV)   2D SDfile   Computed 3D by Vconf -m prep SDfile
Find this compound or compounds like it in BindingDB:
Activity Spreadsheet -- Enzyme Inhibition Constant Data from BindingDB
Found 2 hits for monomerid = 490
TargetGag-Pol polyprotein [489-587](Human immunodeficiency virus type 1)
Washington University
Curated by ChEMBL
LigandPNGBDBM490((2S)-N-[(2S,3R)-4-[benzyl(tert-butylcarbamoyl)amin...)
Affinity DataIC50:  3nM. Assay description: Inhibitory activity against HIV-1 Protease
In DepthDetails ArticlePubMed
TargetDimer of Gag-Pol polyprotein [489-587](Human immunodeficiency virus type 1)
Monsanto Corporate Research
LigandPNGBDBM490((2S)-N-[(2S,3R)-4-[benzyl(tert-butylcarbamoyl)amin...)
Affinity DataIC50:  3nMpH: 6.4 T: 2°C. Assay description: IC50 values for inhibition of recombinant HIV protease were determined using the spectrofluorometric assay, which utilized an intramolecularly quench...
In DepthDetails ArticlePubMed