BDBM4906 (3Z)-2-oxo-3-(4,5,6,7-tetrahydro-1H-indol-2-ylmethylidene)-2,3-dihydro-1H-indole-5-sulfonamide::2-Oxo-3-(4,5,6,7-tetrahydro-1H-indol-2-ylmethylene)-2,3-dihydro-1H-indole-5-sulfonic Acid Amide::Indolin-2-one deriv. 4c
SMILES NS(=O)(=O)c1ccc2NC(=O)\C(=C/c3cc4CCCCc4[nH]3)c2c1
InChI Key InChIKey=FHSRUXRMSRJDQV-ZSOIEALJSA-N
Data  5 IC50
  Tab Delimited (TSV)   2D SDfile   Computed 3D by Vconf -m prep SDfile
Find this compound or compounds like it in BindingDB:
Activity Spreadsheet -- Enzyme Inhibition Constant Data from BindingDB
Found 5 hits for monomerid = 4906
TargetVascular endothelial growth factor receptor 2(Homo sapiens (Human))
Sugen
LigandPNGBDBM4906((3Z)-2-oxo-3-(4,5,6,7-tetrahydro-1H-indol-2-ylmeth...)
Affinity DataIC50:  30nMpH: 7.5 T: 2°C. Assay description: The assays were performed in 96-well microtiter plates that had been coated with a polyGluTyr peptide. Negative control wells received buffer alone w...
In DepthDetails ArticlePubMed
TargetFibroblast growth factor receptor 1(Homo sapiens (Human))
Sugen
LigandPNGBDBM4906((3Z)-2-oxo-3-(4,5,6,7-tetrahydro-1H-indol-2-ylmeth...)
Affinity DataIC50:  220nM. Assay description: The assays were performed in 96-well microtiter plates that had been coated with a polyGluTyr peptide. Negative control wells received buffer alone w...
In DepthDetails ArticlePubMed
TargetEpidermal growth factor receptor(Homo sapiens (Human))
Sugen
LigandPNGBDBM4906((3Z)-2-oxo-3-(4,5,6,7-tetrahydro-1H-indol-2-ylmeth...)
Affinity DataIC50: >1.00E+5nM. Assay description: IC50 is the inhibitor concentration which inhibits 50% of EGF-R or PDGFR-beta kinase autophosphorylation activity. The assay was performed in 96-well...
In DepthDetails ArticlePubMed
TargetPlatelet-derived growth factor receptor beta(Homo sapiens (Human))
Sugen
LigandPNGBDBM4906((3Z)-2-oxo-3-(4,5,6,7-tetrahydro-1H-indol-2-ylmeth...)
Affinity DataIC50:  1.15E+4nM. Assay description: IC50 is the inhibitor concentration which inhibits 50% of EGF-R or PDGFR-beta kinase autophosphorylation activity. The assay was performed in 96-well...
In DepthDetails ArticlePubMed
TargetProto-oncogene tyrosine-protein kinase Src(Homo sapiens (Human))
Sugen
LigandPNGBDBM4906((3Z)-2-oxo-3-(4,5,6,7-tetrahydro-1H-indol-2-ylmeth...)
Affinity DataIC50:  80nM. Assay description: The assays were performed in 96-well microtiter plates that had been coated with a polyGluTyr peptide. Negative control wells received buffer alone w...
In DepthDetails ArticlePubMed