BDBM4914 3-(2-{[(3Z)-2-oxo-2,3-dihydro-1H-indol-3-ylidene]methyl}-4,5,6,7-tetrahydro-1H-indol-3-yl)propanoic acid::3-[2-(2-Oxo-1,2-dihydroindol-3-ylidenemethyl)-4,5,6,7-tetrahydro-1H-indol-3-yl]propionic Acid::Indolin-2-one deriv. 9a
SMILES OC(=O)CCc1c(\C=C2/C(=O)Nc3ccccc23)[nH]c2CCCCc12
InChI Key InChIKey=NPNOMACTPXEJJY-PTNGSMBKSA-N
Data  5 IC50
  Tab Delimited (TSV)   2D SDfile   Computed 3D by Vconf -m prep SDfile
Find this compound or compounds like it in BindingDB:
Activity Spreadsheet -- Enzyme Inhibition Constant Data from BindingDB
Found 5 hits for monomerid = 4914
TargetVascular endothelial growth factor receptor 2(Homo sapiens (Human))
Sugen
LigandPNGBDBM4914(3-(2-{[(3Z)-2-oxo-2,3-dihydro-1H-indol-3-ylidene]m...)
Affinity DataIC50:  90nMpH: 7.5 T: 2°C. Assay description: The assays were performed in 96-well microtiter plates that had been coated with a polyGluTyr peptide. Negative control wells received buffer alone w...
In DepthDetails ArticlePubMed
TargetFibroblast growth factor receptor 1(Homo sapiens (Human))
Sugen
LigandPNGBDBM4914(3-(2-{[(3Z)-2-oxo-2,3-dihydro-1H-indol-3-ylidene]m...)
Affinity DataIC50:  270nM. Assay description: The assays were performed in 96-well microtiter plates that had been coated with a polyGluTyr peptide. Negative control wells received buffer alone w...
In DepthDetails ArticlePubMed
TargetEpidermal growth factor receptor(Homo sapiens (Human))
Sugen
LigandPNGBDBM4914(3-(2-{[(3Z)-2-oxo-2,3-dihydro-1H-indol-3-ylidene]m...)
Affinity DataIC50: >1.00E+5nM. Assay description: IC50 is the inhibitor concentration which inhibits 50% of EGF-R or PDGFR-beta kinase autophosphorylation activity. The assay was performed in 96-well...
In DepthDetails ArticlePubMed
TargetPlatelet-derived growth factor receptor beta(Homo sapiens (Human))
Sugen
LigandPNGBDBM4914(3-(2-{[(3Z)-2-oxo-2,3-dihydro-1H-indol-3-ylidene]m...)
Affinity DataIC50:  240nM. Assay description: IC50 is the inhibitor concentration which inhibits 50% of EGF-R or PDGFR-beta kinase autophosphorylation activity. The assay was performed in 96-well...
In DepthDetails ArticlePubMed
TargetProto-oncogene tyrosine-protein kinase Src(Homo sapiens (Human))
Sugen
LigandPNGBDBM4914(3-(2-{[(3Z)-2-oxo-2,3-dihydro-1H-indol-3-ylidene]m...)
Affinity DataIC50:  1.89E+3nM. Assay description: The assays were performed in 96-well microtiter plates that had been coated with a polyGluTyr peptide. Negative control wells received buffer alone w...
In DepthDetails ArticlePubMed