BDBM49342 MLS000109333::N-[2-(2-bromophenyl)-1,3-benzoxazol-5-yl]propanamide::N-[2-(2-bromophenyl)-1,3-benzoxazol-5-yl]propionamide::SMR000105277::cid_738874
SMILES CCC(=O)Nc1ccc2oc(nc2c1)-c1ccccc1Br
InChI Key InChIKey=VHPMXIAITVEOMD-UHFFFAOYSA-N
Data  1 EC50
  Tab Delimited (TSV)   2D SDfile   Computed 3D by Vconf -m prep SDfile
Find this compound or compounds like it in BindingDB:
Activity Spreadsheet -- Enzyme Inhibition Constant Data from BindingDB
Found 1 hit for monomerid = 49342
TargetTranscription factor p65(Homo sapiens (Human))
Srmlsc
Curated by PubChem BioAssay
LigandPNGBDBM49342(MLS000109333 | N-[2-(2-bromophenyl)-1,3-benzoxazol...)
Affinity DataEC50:  2.64E+3nM. Assay description: Southern Research Molecular Libraries Screening Center (SRMLSC) Southern Research Institute (Birmingham, Alabama) NIH Molecular Libraries Screening C...
In DepthDetails PCBioAssay