BDBM49347 MLS000107633::SMR000103599::[5-(3,4-dichlorophenyl)-2-furanyl]-(4-morpholinyl)methanethione::[5-(3,4-dichlorophenyl)-2-furyl]-morpholino-methanethione::[5-(3,4-dichlorophenyl)furan-2-yl]-morpholin-4-yl-methanethione::[5-(3,4-dichlorophenyl)furan-2-yl]-morpholin-4-ylmethanethione::cid_947873
SMILES Clc1ccc(cc1Cl)-c1ccc(o1)C(=S)N1CCOCC1
InChI Key InChIKey=WOHXXLNZHJZIFM-UHFFFAOYSA-N
Data  1 EC50
  Tab Delimited (TSV)   2D SDfile   Computed 3D by Vconf -m prep SDfile
Find this compound or compounds like it in BindingDB:
Activity Spreadsheet -- Enzyme Inhibition Constant Data from BindingDB
Found 1 hit for monomerid = 49347
TargetTranscription factor p65(Homo sapiens (Human))
Srmlsc
Curated by PubChem BioAssay
LigandPNGBDBM49347(MLS000107633 | SMR000103599 | [5-(3,4-dichlorophen...)
Affinity DataEC50:  5.19E+3nM. Assay description: Southern Research Molecular Libraries Screening Center (SRMLSC) Southern Research Institute (Birmingham, Alabama) NIH Molecular Libraries Screening C...
In DepthDetails PCBioAssay