BDBM49398 6-methyl-2-(4-methylphenyl)-1H-quinolin-4-one::6-methyl-2-(p-tolyl)-4-quinolone::MLS000517822::SMR000129062::cid_9547788
SMILES Cc1ccc(cc1)-c1cc(O)c2cc(C)ccc2n1
InChI Key InChIKey=VCYZKLFXEAREHG-UHFFFAOYSA-N
Data  1 EC50
  Tab Delimited (TSV)   2D SDfile   Computed 3D by Vconf -m prep SDfile
Find this compound or compounds like it in BindingDB:
Activity Spreadsheet -- Enzyme Inhibition Constant Data from BindingDB
Found 1 hit for monomerid = 49398
TargetTranscription factor p65(Homo sapiens (Human))
Srmlsc
Curated by PubChem BioAssay
LigandPNGBDBM49398(6-methyl-2-(4-methylphenyl)-1H-quinolin-4-one | 6-...)
Affinity DataEC50:  2.67E+5nM. Assay description: Southern Research Molecular Libraries Screening Center (SRMLSC) Southern Research Institute (Birmingham, Alabama) NIH Molecular Libraries Screening C...
In DepthDetails PCBioAssay