BDBM49411 (2,4-dimethoxyphenyl)-[4-(2-thienyl)thiazol-2-yl]amine::MLS000536946::N-(2,4-dimethoxyphenyl)-4-(2-thienyl)-1,3-thiazol-2-amine::N-(2,4-dimethoxyphenyl)-4-thiophen-2-yl-1,3-thiazol-2-amine::N-(2,4-dimethoxyphenyl)-4-thiophen-2-yl-2-thiazolamine::SMR000143583::cid_973116
SMILES COc1ccc(Nc2nc(cs2)-c2cccs2)c(OC)c1
InChI Key InChIKey=UNEUKGGZQYVAPI-UHFFFAOYSA-N
Data  1 EC50
  Tab Delimited (TSV)   2D SDfile   Computed 3D by Vconf -m prep SDfile
Find this compound or compounds like it in BindingDB:
Activity Spreadsheet -- Enzyme Inhibition Constant Data from BindingDB
Found 1 hit for monomerid = 49411
TargetTranscription factor p65(Homo sapiens (Human))
Srmlsc
Curated by PubChem BioAssay
LigandPNGBDBM49411((2,4-dimethoxyphenyl)-[4-(2-thienyl)thiazol-2-yl]a...)
Affinity DataEC50:  2.33E+3nM. Assay description: Southern Research Molecular Libraries Screening Center (SRMLSC) Southern Research Institute (Birmingham, Alabama) NIH Molecular Libraries Screening C...
In DepthDetails PCBioAssay