BDBM49493 2-(5-bromanylthiophen-2-yl)imidazo[1,2-a]pyridine::2-(5-bromo-2-thienyl)imidazo[1,2-a]pyridine::2-(5-bromo-2-thiophenyl)imidazo[1,2-a]pyridine::2-(5-bromothiophen-2-yl)imidazo[1,2-a]pyridine::MLS000544361::SMR000162876::cid_711734
SMILES Brc1ccc(s1)-c1cn2ccccc2n1
InChI Key InChIKey=PCLHOEDIIPVWHU-UHFFFAOYSA-N
Data  2 IC50  2 EC50
  Tab Delimited (TSV)   2D SDfile   Computed 3D by Vconf -m prep SDfile
Find this compound or compounds like it in BindingDB:
Activity Spreadsheet -- Enzyme Inhibition Constant Data from BindingDB
Found 4 hits for monomerid = 49493
TargetTranscription factor p65(Homo sapiens (Human))
Srmlsc
Curated by PubChem BioAssay
LigandPNGBDBM49493(2-(5-bromanylthiophen-2-yl)imidazo[1,2-a]pyridine ...)
Affinity DataEC50:  94nM. Assay description: Southern Research Molecular Libraries Screening Center (SRMLSC) Southern Research Institute (Birmingham, Alabama) NIH Molecular Libraries Screening C...
In DepthDetails PCBioAssay
TargetTumor necrosis factor receptor superfamily member 10B(Homo sapiens (Human))
Burnham Center For Chemical Genomics
Curated by PubChem BioAssay
LigandPNGBDBM49493(2-(5-bromanylthiophen-2-yl)imidazo[1,2-a]pyridine ...)
Affinity DataEC50: >1.25E+4nM
In DepthDetails PCBioAssay
TargetHeat shock protein hsp-16.2(Caenorhabditis elegans)
Burnham Center For Chemical Genomics
Curated by PubChem BioAssay
LigandPNGBDBM49493(2-(5-bromanylthiophen-2-yl)imidazo[1,2-a]pyridine ...)
Affinity DataIC50:  4.45E+4nM
In DepthDetails PCBioAssay
TargetProtein skinhead-1(Caenorhabditis elegans)
Burnham Center For Chemical Genomics
Curated by PubChem BioAssay
LigandPNGBDBM49493(2-(5-bromanylthiophen-2-yl)imidazo[1,2-a]pyridine ...)
Affinity DataIC50:  1.81E+4nM
In DepthDetails PCBioAssay