BDBM49670 1,3-benzothiazol-2-yl-(2,3-dimethylphenyl)amine::MLS000417163::N-(2,3-dimethylphenyl)-1,3-benzothiazol-2-amine::SMR000264359::cid_853543
SMILES Cc1cccc(Nc2nc3ccccc3s2)c1C
InChI Key InChIKey=ZCMZHHNZRORCCO-UHFFFAOYSA-N
Data  1 EC50
  Tab Delimited (TSV)   2D SDfile   Computed 3D by Vconf -m prep SDfile
Find this compound or compounds like it in BindingDB:
Activity Spreadsheet -- Enzyme Inhibition Constant Data from BindingDB
Found 1 hit for monomerid = 49670
TargetTranscription factor p65(Homo sapiens (Human))
Srmlsc
Curated by PubChem BioAssay
LigandPNGBDBM49670(1,3-benzothiazol-2-yl-(2,3-dimethylphenyl)amine | ...)
Affinity DataEC50:  4.27E+3nM. Assay description: Southern Research Molecular Libraries Screening Center (SRMLSC) Southern Research Institute (Birmingham, Alabama) NIH Molecular Libraries Screening C...
In DepthDetails PCBioAssay