BDBM498334 US11014911, Example 159::US11014911, Example 160::US11718603, Example 160
SMILES C[C@H]1[C@@H](CN1C(=O)O[C@@H]1CC[C@@H](C1)c1cc(NC(=O)Cc2cnc(C)s2)n[nH]1)C#N
InChI Key
Data  8 KI
  Tab Delimited (TSV)   2D SDfile   Computed 3D by Vconf -m prep SDfile
Find this compound or compounds like it in BindingDB:
Activity Spreadsheet -- Enzyme Inhibition Constant Data from BindingDB
Found 8 hits for monomerid = 498334
TargetCyclin-dependent kinase 2/G1/S-specific cyclin-E1(Homo sapiens (Human))
Pfizer
US Patent
LigandPNGBDBM498334(US11014911, Example 159 | US11014911, Example 160 ...)
Affinity DataKi:  0.150nM. Assay description: The purpose of CDK2/Cyclin E1 assay is to evaluate the inhibition (% inhibition, Kiapp and Ki values) of small molecule inhibitors by using a fluores...
Ligand InfoPC cidPC sid
In DepthDetails US Patent
TargetCyclin-dependent kinase 2/G1/S-specific cyclin-E1(Homo sapiens (Human))
Pfizer
US Patent
LigandPNGBDBM498334(US11014911, Example 159 | US11014911, Example 160 ...)
Affinity DataKi:  0.150nM. Assay description: The purpose of CDK2/Cyclin E1 assay is to evaluate the inhibition (% inhibition, Kiapp and Ki values) of small molecule inhibitors by using a fluores...
Ligand InfoPC cidPC sid
In DepthDetails US Patent
TargetCyclin-dependent kinase 2/G1/S-specific cyclin-E1(Homo sapiens (Human))
Pfizer
US Patent
LigandPNGBDBM498334(US11014911, Example 159 | US11014911, Example 160 ...)
Affinity DataKi:  0.150nM. Assay description: Inhibition of recombinant full length wild-type CDK2/Cyclin E1 (unknown origin) expressed in baculovirus expression system assessed as reduction in p...
Ligand InfoPC cidPC sid
In DepthDetails ArticlePubMed
TargetGlycogen synthase kinase-3 beta(Homo sapiens (Human))
Smith, Gambrell & Russell
Curated by ChEMBL
LigandPNGBDBM498334(US11014911, Example 159 | US11014911, Example 160 ...)
Affinity DataKi:  1.70nM. Assay description: Inhibition of N-terminal His6-tagged human recombinant GSK3beta H350L mutant expressed in baculovirus-infected Sf21 cells assessed as reduction in pr...
Ligand InfoPC cidPC sid
In DepthDetails ArticlePubMed
TargetGlycogen synthase kinase-3 beta(Homo sapiens (Human))
Smith, Gambrell & Russell
Curated by ChEMBL
LigandPNGBDBM498334(US11014911, Example 159 | US11014911, Example 160 ...)
Affinity DataKi:  1.72nM. Assay description: The purpose of GSK3β assay is to evaluate the inhibition (% inhibition, Kiapp and Ki values) of small molecule inhibitors by using a fluorescenc...
Ligand InfoPC cidPC sid
In DepthDetails US Patent
TargetGlycogen synthase kinase-3 beta(Homo sapiens (Human))
Smith, Gambrell & Russell
Curated by ChEMBL
LigandPNGBDBM498334(US11014911, Example 159 | US11014911, Example 160 ...)
Affinity DataKi:  1.72nM. Assay description: The purpose of GSK3β assay is to evaluate the inhibition (% inhibition, Kiapp and Ki values) of small molecule inhibitors by using a fluorescenc...
Ligand InfoPC cidPC sid
In DepthDetails US Patent
TargetCyclin-dependent kinase 2/G1/S-specific cyclin-E1(Homo sapiens (Human))
Pfizer
US Patent
LigandPNGBDBM498334(US11014911, Example 159 | US11014911, Example 160 ...)
Affinity DataKi:  3.63nM. Assay description: The purpose of CDK2/Cyclin E1 assay is to evaluate the inhibition (% inhibition, Kiapp and Ki values) of small molecule inhibitors by using a fluores...
Ligand InfoPC cidPC sid
In DepthDetails US Patent
TargetCyclin-dependent kinase 2/G1/S-specific cyclin-E1(Homo sapiens (Human))
Pfizer
US Patent
LigandPNGBDBM498334(US11014911, Example 159 | US11014911, Example 160 ...)
Affinity DataKi:  3.63nM. Assay description: The purpose of CDK2/Cyclin E1 assay is to evaluate the inhibition (% inhibition, Kiapp and Ki values) of small molecule inhibitors by using a fluores...
Ligand InfoPC cidPC sid
In DepthDetails US Patent