BDBM498707 (1R,3S)-3-(3-{[(6- methoxypyridin-3- yl)acetyl]amino}-1H-pyrazol-5- yl)cyclopentyl [(2$#958;)-2- (hydroxymethyl)butyl] carbamate - Isomer A::US11014911, Example 532::US11014911, Example 533::US11718603, Example 533
SMILES CCC(CO)CNC(=O)O[C@@H]1CC[C@@H](C1)c1cc(NC(=O)Cc2ccc(OC)nc2)n[nH]1
InChI Key
Data  10 KI
  Tab Delimited (TSV)   2D SDfile   Computed 3D by Vconf -m prep SDfile
Find this compound or compounds like it in BindingDB:
Activity Spreadsheet -- Enzyme Inhibition Constant Data from BindingDB
Found 10 hits for monomerid = 498707
TargetCyclin-dependent kinase 2/G1/S-specific cyclin-E1(Homo sapiens (Human))
Pfizer
US Patent
LigandPNGBDBM498707((1R,3S)-3-(3-{[(6- methoxypyridin-3- yl)acetyl]a...)
Affinity DataKi:  0.770nM. Assay description: The purpose of CDK2/Cyclin E1 assay is to evaluate the inhibition (% inhibition, Kiapp and Ki values) of small molecule inhibitors by using a fluores...
Ligand InfoPC cidPC sid
In DepthDetails US Patent
TargetCyclin-dependent kinase 2/G1/S-specific cyclin-E1(Homo sapiens (Human))
Pfizer
US Patent
LigandPNGBDBM498707((1R,3S)-3-(3-{[(6- methoxypyridin-3- yl)acetyl]a...)
Affinity DataKi:  0.770nM. Assay description: The purpose of CDK2/Cyclin E1 assay is to evaluate the inhibition (% inhibition, Kiapp and Ki values) of small molecule inhibitors by using a fluores...
Ligand InfoPC cidPC sid
In DepthDetails US Patent
TargetCyclin-dependent kinase 2/G1/S-specific cyclin-E1(Homo sapiens (Human))
Pfizer
US Patent
LigandPNGBDBM498707((1R,3S)-3-(3-{[(6- methoxypyridin-3- yl)acetyl]a...)
Affinity DataKi:  0.770nM. Assay description: Inhibition of recombinant full length wild-type CDK2/Cyclin E1 (unknown origin) expressed in baculovirus expression system assessed as reduction in p...
Ligand InfoPC cidPC sid
In DepthDetails ArticlePubMed
TargetCyclin-dependent kinase 2/G1/S-specific cyclin-E1(Homo sapiens (Human))
Pfizer
US Patent
LigandPNGBDBM498707((1R,3S)-3-(3-{[(6- methoxypyridin-3- yl)acetyl]a...)
Affinity DataKi:  0.890nM. Assay description: The purpose of CDK2/Cyclin E1 assay is to evaluate the inhibition (% inhibition, Kiapp and Ki values) of small molecule inhibitors by using a fluores...
Ligand InfoPC cidPC sid
In DepthDetails US Patent
TargetCyclin-dependent kinase 2/G1/S-specific cyclin-E1(Homo sapiens (Human))
Pfizer
US Patent
LigandPNGBDBM498707((1R,3S)-3-(3-{[(6- methoxypyridin-3- yl)acetyl]a...)
Affinity DataKi:  0.890nM. Assay description: The purpose of CDK2/Cyclin E1 assay is to evaluate the inhibition (% inhibition, Kiapp and Ki values) of small molecule inhibitors by using a fluores...
Ligand InfoPC cidPC sid
In DepthDetails US Patent
TargetGlycogen synthase kinase-3 beta(Homo sapiens (Human))
Smith, Gambrell & Russell
Curated by ChEMBL
LigandPNGBDBM498707((1R,3S)-3-(3-{[(6- methoxypyridin-3- yl)acetyl]a...)
Affinity DataKi:  1.40nM. Assay description: Inhibition of N-terminal His6-tagged human recombinant GSK3beta H350L mutant expressed in baculovirus-infected Sf21 cells assessed as reduction in pr...
Ligand InfoPC cidPC sid
In DepthDetails ArticlePubMed
TargetGlycogen synthase kinase-3 beta(Homo sapiens (Human))
Smith, Gambrell & Russell
Curated by ChEMBL
LigandPNGBDBM498707((1R,3S)-3-(3-{[(6- methoxypyridin-3- yl)acetyl]a...)
Affinity DataKi:  1.41nM. Assay description: The purpose of GSK3β assay is to evaluate the inhibition (% inhibition, Kiapp and Ki values) of small molecule inhibitors by using a fluorescenc...
Ligand InfoPC cidPC sid
In DepthDetails US Patent
TargetGlycogen synthase kinase-3 beta(Homo sapiens (Human))
Smith, Gambrell & Russell
Curated by ChEMBL
LigandPNGBDBM498707((1R,3S)-3-(3-{[(6- methoxypyridin-3- yl)acetyl]a...)
Affinity DataKi:  1.41nM. Assay description: The purpose of GSK3β assay is to evaluate the inhibition (% inhibition, Kiapp and Ki values) of small molecule inhibitors by using a fluorescenc...
Ligand InfoPC cidPC sid
In DepthDetails US Patent
TargetGlycogen synthase kinase-3 beta(Homo sapiens (Human))
Smith, Gambrell & Russell
Curated by ChEMBL
LigandPNGBDBM498707((1R,3S)-3-(3-{[(6- methoxypyridin-3- yl)acetyl]a...)
Affinity DataKi:  2.97nM. Assay description: The purpose of GSK3β assay is to evaluate the inhibition (% inhibition, Kiapp and Ki values) of small molecule inhibitors by using a fluorescenc...
Ligand InfoPC cidPC sid
In DepthDetails US Patent
TargetGlycogen synthase kinase-3 beta(Homo sapiens (Human))
Smith, Gambrell & Russell
Curated by ChEMBL
LigandPNGBDBM498707((1R,3S)-3-(3-{[(6- methoxypyridin-3- yl)acetyl]a...)
Affinity DataKi:  2.97nM. Assay description: The purpose of GSK3β assay is to evaluate the inhibition (% inhibition, Kiapp and Ki values) of small molecule inhibitors by using a fluorescenc...
Ligand InfoPC cidPC sid
In DepthDetails US Patent