BDBM50000005 CHEMBL2370803::[Ac-(D)Nal-(D)Cpa-(D)Pal-Ser-Lys(atz)-(D)Lys(atz)-Leu-ILys-Pro-Gly-NH2]GnRH
SMILES CC(C)C[C@H](NC(=O)[C@H](CCCCNc1n[nH]c(N)n1)NC(=O)[C@H](CCCCNc1n[nH]c(N)n1)NC(=O)[C@H](CO)NC(=O)[C@@H](Cc1cccnc1)NC(=O)[C@H](Cc1ccc(Cl)cc1)NC(=O)[C@@H](Cc1ccc2ccccc2c1)NC(C)=O)C(=O)N[C@@H](CCCCNC(C)C)C(=O)N1CCC[C@@H]1C(=O)NCC(N)=O
InChI Key InChIKey=NMSXEWUHKZGBLF-XDYOGTAISA-N
Data  1 Kd
  Tab Delimited (TSV)   2D SDfile   Computed 3D by Vconf -m prep SDfile
Find this compound or compounds like it in BindingDB:
Activity Spreadsheet -- Enzyme Inhibition Constant Data from BindingDB
Found 1 hit for monomerid = 50000005
TargetGonadotropin-releasing hormone receptor(Homo sapiens (Human))
Salk Institute
Curated by ChEMBL
LigandPNGBDBM50000005(CHEMBL2370803 | [Ac-(D)Nal-(D)Cpa-(D)Pal-Ser-Lys(a...)
Affinity DataKd:  0.860nM. Assay description: The binding affinity towards Gonadotropin-releasing hormone receptor
In DepthDetails ArticlePubMed