BDBM50000063 CHEMBL3228339
SMILES OC(=O)C(O)=O.C1Cc2nccn2C1
InChI Key InChIKey=UBAYBAPPRBAPDH-UHFFFAOYSA-N
Data  1 IC50
  Tab Delimited (TSV)   2D SDfile   Computed 3D by Vconf -m prep SDfile
Find this compound or compounds like it in BindingDB:
Activity Spreadsheet -- Enzyme Inhibition Constant Data from BindingDB
Found 1 hit for monomerid = 50000063
TargetIndolethylamine N-methyltransferase(Oryctolagus cuniculus)
TBA
Curated by ChEMBL
LigandPNGBDBM50000063(CHEMBL3228339)
Affinity DataIC50:  8.31E+4nM. Assay description: Inhibition of New Zealand white rabbit lung INMT using N-methyltryptamine as substrate after 60 to 90 mins by liquid scintillation counting in presen...
In DepthDetails ArticlePubMed