BDBM50000174 CHEMBL3228330
SMILES CI.C1CN2CCCN=C2C1
InChI Key InChIKey=OTPAZPODXWNINC-UHFFFAOYSA-N
Data  1 IC50
  Tab Delimited (TSV)   2D SDfile   Computed 3D by Vconf -m prep SDfile
Find this compound or compounds like it in BindingDB:
Activity Spreadsheet -- Enzyme Inhibition Constant Data from BindingDB
Found 1 hit for monomerid = 50000174
TargetIndolethylamine N-methyltransferase(Oryctolagus cuniculus)
TBA
Curated by ChEMBL
LigandPNGBDBM50000174(CHEMBL3228330)
Affinity DataIC50:  3.87E+4nM. Assay description: Inhibition of New Zealand white rabbit lung INMT using N-methyltryptamine as substrate after 60 to 90 mins by liquid scintillation counting in presen...
In DepthDetails ArticlePubMed