BDBM50000324 CHEMBL3228400
SMILES CN1CCC=CC1=N
InChI Key InChIKey=IRHHGELGAAZXIU-WLHGVMLRSA-N
Data  2 IC50
  Tab Delimited (TSV)   2D SDfile   Computed 3D by Vconf -m prep SDfile
Find this compound or compounds like it in BindingDB:
Activity Spreadsheet -- Enzyme Inhibition Constant Data from BindingDB
Found 2 hits for monomerid = 50000324
TargetIndolethylamine N-methyltransferase(Homo sapiens (Human))
TBA
Curated by ChEMBL
LigandPNGBDBM50000324(CHEMBL3228400)
Affinity DataIC50:  7.90E+3nM. Assay description: Inhibition of human lung INMT using N-methyltryptamine as substrate after 60 to 90 mins by liquid scintillation counting in presence of S-methyl-[14C...
In DepthDetails ArticlePubMed
TargetIndolethylamine N-methyltransferase(Oryctolagus cuniculus)
TBA
Curated by ChEMBL
LigandPNGBDBM50000324(CHEMBL3228400)
Affinity DataIC50:  900nM. Assay description: Inhibition of New Zealand white rabbit lung INMT using N-methyltryptamine as substrate after 60 to 90 mins by liquid scintillation counting in presen...
In DepthDetails ArticlePubMed