BDBM50000330 CHEMBL3228405
SMILES I.Cc1cc(=N)sn1C
InChI Key InChIKey=YGMNBKJZSPCVNB-UHFFFAOYSA-N
Data  2 IC50
  Tab Delimited (TSV)   2D SDfile   Computed 3D by Vconf -m prep SDfile
Find this compound or compounds like it in BindingDB:
Activity Spreadsheet -- Enzyme Inhibition Constant Data from BindingDB
Found 2 hits for monomerid = 50000330
TargetIndolethylamine N-methyltransferase(Homo sapiens (Human))
TBA
Curated by ChEMBL
LigandPNGBDBM50000330(CHEMBL3228405)
Affinity DataIC50:  4.54E+4nM. Assay description: Inhibition of human lung INMT using N-methyltryptamine as substrate after 60 to 90 mins by liquid scintillation counting in presence of S-methyl-[14C...
In DepthDetails ArticlePubMed
TargetIndolethylamine N-methyltransferase(Oryctolagus cuniculus)
TBA
Curated by ChEMBL
LigandPNGBDBM50000330(CHEMBL3228405)
Affinity DataIC50:  1.96E+4nM. Assay description: Inhibition of New Zealand white rabbit lung INMT using N-methyltryptamine as substrate after 60 to 90 mins by liquid scintillation counting in presen...
In DepthDetails ArticlePubMed