BDBM50000421 5-(3,4,5-Trimethoxy-phenylcarbamoyl)-pyridine-2-carboxylic acid; acetic acid::CHEMBL167574
SMILES COc1cc(NC(=O)c2ccc(nc2)C(O)=O)cc(OC)c1OC
InChI Key InChIKey=ZUMOXMDZUMTQNY-UHFFFAOYSA-N
Data  1 IC50
  Tab Delimited (TSV)   2D SDfile   Computed 3D by Vconf -m prep SDfile
Find this compound or compounds like it in BindingDB:
Activity Spreadsheet -- Enzyme Inhibition Constant Data from BindingDB
Found 1 hit for monomerid = 50000421
TargetTransmembrane prolyl 4-hydroxylase(Homo sapiens (Human))
Ici Pharmaceuticals Group
Curated by ChEMBL
LigandPNGBDBM50000421(5-(3,4,5-Trimethoxy-phenylcarbamoyl)-pyridine-2-ca...)
Affinity DataIC50:  2.65E+4nM. Assay description: Inhibition of prolyl 4-hydroxylase activity by an indirect assay
In DepthDetails ArticlePubMed