BDBM50000535 3,3-Dimethyl-2-phenethyl-6-(3-phenoxy-propyl)-2,3-dihydro-benzofuran-5-ol::CHEMBL25262
SMILES CC1(C)C(CCc2ccccc2)Oc2cc(CCCOc3ccccc3)c(O)cc12
InChI Key InChIKey=KLDYTBQCBXQCSW-UHFFFAOYSA-N
Data  1 IC50
  Tab Delimited (TSV)   2D SDfile   Computed 3D by Vconf -m prep SDfile
Find this compound or compounds like it in BindingDB:
Activity Spreadsheet -- Enzyme Inhibition Constant Data from BindingDB
Found 1 hit for monomerid = 50000535
TargetPolyunsaturated fatty acid 5-lipoxygenase(Rattus norvegicus)
Merck Frosst Centre For Therapeutic Research
Curated by ChEMBL
LigandPNGBDBM50000535(3,3-Dimethyl-2-phenethyl-6-(3-phenoxy-propyl)-2,3-...)
Affinity DataIC50:  40nM. Assay description: Tested for its inhibitory activity against arachidonic acid in rat 5-lipoxygenase.
In DepthDetails ArticlePubMed