BDBM50000585 6-(6-Piperidin-1-yl-hexyloxy)-2-pyridin-3-yl-chromen-4-one::CHEMBL39163
SMILES O=c1cc(oc2ccc(OCCCCCCN3CCCCC3)cc12)-c1cccnc1
InChI Key InChIKey=CCDAXHSDQCUZEE-UHFFFAOYSA-N
Data  1 KI  2 IC50
  Tab Delimited (TSV)   2D SDfile   Computed 3D by Vconf -m prep SDfile
Find this compound or compounds like it in BindingDB:
Activity Spreadsheet -- Enzyme Inhibition Constant Data from BindingDB
Found 3 hits for monomerid = 50000585
TargetD(2) dopamine receptor(Rattus norvegicus (rat))
Nova Pharmaceutical
Curated by ChEMBL
LigandPNGBDBM50000585(6-(6-Piperidin-1-yl-hexyloxy)-2-pyridin-3-yl-chrom...)
Affinity DataKi:  2.30E+3nM. Assay description: Affinity towards dopamine receptor D2 was determined by competition studies using [3H]-sulpiride in rat striatum.
In DepthDetails ArticlePubMed
TargetSigma non-opioid intracellular receptor 1(Homo sapiens (Human))
Nova Pharmaceutical
Curated by ChEMBL
LigandPNGBDBM50000585(6-(6-Piperidin-1-yl-hexyloxy)-2-pyridin-3-yl-chrom...)
Affinity DataIC50:  119nM. Assay description: Potency at the sigma binding site was determined in radioligand
In DepthDetails ArticlePubMed
TargetSigma non-opioid intracellular receptor 1(Homo sapiens (Human))
Nova Pharmaceutical
Curated by ChEMBL
LigandPNGBDBM50000585(6-(6-Piperidin-1-yl-hexyloxy)-2-pyridin-3-yl-chrom...)
Affinity DataIC50:  192nM. Assay description: Potency at the sigma binding site was determined in radioligand
In DepthDetails ArticlePubMed