BDBM50000615 2-Phenyl-6-[6-(2-pyridin-2-yl-piperazin-1-yl)-hexyloxy]-chromen-4-one::CHEMBL37468
SMILES O=c1cc(oc2ccc(OCCCCCCN3CCNCC3c3ccccn3)cc12)-c1ccccc1
InChI Key InChIKey=FOTDOIGKSDTJRO-UHFFFAOYSA-N
Data  1 KI  2 IC50
  Tab Delimited (TSV)   2D SDfile   Computed 3D by Vconf -m prep SDfile
Find this compound or compounds like it in BindingDB:
Activity Spreadsheet -- Enzyme Inhibition Constant Data from BindingDB
Found 3 hits for monomerid = 50000615
TargetD(2) dopamine receptor(Rattus norvegicus (rat))
Nova Pharmaceutical
Curated by ChEMBL
LigandPNGBDBM50000615(2-Phenyl-6-[6-(2-pyridin-2-yl-piperazin-1-yl)-hexy...)
Affinity DataKi:  3.00E+3nM. Assay description: Affinity towards dopamine receptor D2 site was determined by competition studies using [3H]-sulpiride in rat striatum.
In DepthDetails ArticlePubMed
TargetSigma non-opioid intracellular receptor 1(Homo sapiens (Human))
Nova Pharmaceutical
Curated by ChEMBL
LigandPNGBDBM50000615(2-Phenyl-6-[6-(2-pyridin-2-yl-piperazin-1-yl)-hexy...)
Affinity DataIC50:  928nM. Assay description: Potency at the sigma binding site was determined in radioligand
In DepthDetails ArticlePubMed
TargetSigma non-opioid intracellular receptor 1(Homo sapiens (Human))
Nova Pharmaceutical
Curated by ChEMBL
LigandPNGBDBM50000615(2-Phenyl-6-[6-(2-pyridin-2-yl-piperazin-1-yl)-hexy...)
Affinity DataIC50:  235nM. Assay description: Potency at the sigma binding site was determined in radioligand
In DepthDetails ArticlePubMed