BDBM50000694 CHEMBL51921
SMILES CC[C@H](C)[C@H](NC(=O)[C@@H]1CCCN1C[C@@H](CC(=O)[C@H](CC(N)=O)NC(=O)[C@H](CCC(N)=O)NC(=O)[C@H](CO)NC(=O)[C@@H](N)C(C)C)Cc1ccccc1)C(=O)N[C@@H](C(C)C)C(O)=O
InChI Key InChIKey=KLDNTFZWLHNUBB-ZNMOCOJZSA-N
Data  1 KI
  Tab Delimited (TSV)   2D SDfile   Computed 3D by Vconf -m prep SDfile
Find this compound or compounds like it in BindingDB:
Activity Spreadsheet -- Enzyme Inhibition Constant Data from BindingDB
Found 1 hit for monomerid = 50000694
TargetGag-Pol polyprotein [489-587](Human immunodeficiency virus type 1)
Ciba-Geigy
Curated by ChEMBL
LigandPNGBDBM50000694(CHEMBL51921)
Affinity DataKi:  3.55E+3nM. Assay description: Binding affinity to HIV-1 proteaseChecked by Author
In DepthDetails ArticlePubMed