BDBM50000696 CHEMBL301833
SMILES CC[C@H](C)[C@H](NC(=O)[C@H](C(C)C)[C@@H](O)[C@H](O)[C@H](CC(C)C)NC(=O)[C@H](Cc1c[nH]cn1)NC(=O)COc1cccc2ccccc12)C(=O)NCc1ccccn1
InChI Key InChIKey=WYFXWUPYXCJJHI-IIUUHNFXSA-N
Data  2 KI
  Tab Delimited (TSV)   2D SDfile   Computed 3D by Vconf -m prep SDfile
Find this compound or compounds like it in BindingDB:
Activity Spreadsheet -- Enzyme Inhibition Constant Data from BindingDB
Found 2 hits for monomerid = 50000696
TargetGag-Pol polyprotein [489-587](Human immunodeficiency virus type 1)
Upjohn
Curated by ChEMBL
LigandPNGBDBM50000696(CHEMBL301833)
Affinity DataKi:  5nM. Assay description: Inhibitory activity against HIV-1 protease
In DepthDetails ArticlePubMed
TargetGag-Pol polyprotein [489-587](Human immunodeficiency virus type 1)
Upjohn
Curated by ChEMBL
LigandPNGBDBM50000696(CHEMBL301833)
Affinity DataKi:  5nM. Assay description: Binding affinity to HIV-1 proteaseChecked by Author
In DepthDetails ArticlePubMed