BDBM50000697 CHEMBL51680
SMILES COC(=O)[C@@H](NC(=O)[C@@H](NC(=O)C[C@H](O)[C@H](Cc1ccc(O)cc1)NC(=O)[C@H](C)NC(=O)[C@H](C)NC(=O)[C@H](CO)NC(=O)OC(C)(C)C)C(C)C)C(C)C
InChI Key InChIKey=WTQJMGCZDKWRPT-MMFBZIFQSA-N
Data  1 KI
  Tab Delimited (TSV)   2D SDfile   Computed 3D by Vconf -m prep SDfile
Find this compound or compounds like it in BindingDB:
Activity Spreadsheet -- Enzyme Inhibition Constant Data from BindingDB
Found 1 hit for monomerid = 50000697
TargetGag-Pol polyprotein [489-587](Human immunodeficiency virus type 1)
Ciba-Geigy
Curated by ChEMBL
LigandPNGBDBM50000697(CHEMBL51680)
Affinity DataKi:  182nM. Assay description: Binding affinity to HIV-1 proteaseChecked by Author
In DepthDetails ArticlePubMed