BDBM50000705 2-({7-[4-(4-Fluoro-phenyl)-1-methyl-butyl]-5-hydroxy-2,2-dimethyl-2H-chromen-4-ylmethyl}-methyl-amino)-N-methyl-acetamide::CHEMBL65228
SMILES CNC(=O)CN(C)CC1=CC(C)(C)Oc2cc(cc(O)c12)C(C)CCCc1ccc(F)cc1
InChI Key InChIKey=NGVWZEZNJDHYTC-UHFFFAOYSA-N
Data  1 KI
  Tab Delimited (TSV)   2D SDfile   Computed 3D by Vconf -m prep SDfile
Find this compound or compounds like it in BindingDB:
Activity Spreadsheet -- Enzyme Inhibition Constant Data from BindingDB
Found 1 hit for monomerid = 50000705
TargetPlatelet-activating factor receptor(Cavia porcellus)
Abbott Laboratories
Curated by ChEMBL
LigandPNGBDBM50000705(2-({7-[4-(4-Fluoro-phenyl)-1-methyl-butyl]-5-hydro...)
Affinity DataKi:  1.58E+3nM. Assay description: In vitro intrinsic binding affinity at platelet activating factor receptor using rabbit platelet membranes
In DepthDetails ArticlePubMed