BDBM50000716 CHEMBL61680::{7-[4-(4-Fluoro-phenyl)-1-methyl-butyl]-10,10-dimethyl-3-methylcarbamoylmethyl-2,3,4,10-tetrahydro-1H-9-oxa-3-aza-phenanthren-5-yloxy}-acetic acid
SMILES CNC(=O)CN1CCC2=C(C1)c1c(OCC(O)=O)cc(cc1OC2(C)C)C(C)CCCc1ccc(F)cc1
InChI Key InChIKey=XKOLIBBUGVTBIL-UHFFFAOYSA-N
Data  1 KI
  Tab Delimited (TSV)   2D SDfile   Computed 3D by Vconf -m prep SDfile
Find this compound or compounds like it in BindingDB:
Activity Spreadsheet -- Enzyme Inhibition Constant Data from BindingDB
Found 1 hit for monomerid = 50000716
TargetPlatelet-activating factor receptor(Cavia porcellus)
Abbott Laboratories
Curated by ChEMBL
LigandPNGBDBM50000716(CHEMBL61680 | {7-[4-(4-Fluoro-phenyl)-1-methyl-but...)
Affinity DataKi:  925nM. Assay description: In vitro intrinsic binding affinity at platelet activating factor receptor using rabbit platelet membranes
In DepthDetails ArticlePubMed