BDBM50000726 4-{7-[4-(4-Fluoro-phenyl)-1-methyl-butyl]-5-hydroxy-10,10-dimethyl-1,2,4,10-tetrahydro-9-oxa-3-aza-phenanthren-3-yl}-N-methyl-butyramide::CHEMBL65377
SMILES CNC(=O)CCCN1CCC2=C(C1)c1c(O)cc(cc1OC2(C)C)C(C)CCCc1ccc(F)cc1
InChI Key InChIKey=KXVBVZCLPVOLMX-UHFFFAOYSA-N
Data  1 KI
  Tab Delimited (TSV)   2D SDfile   Computed 3D by Vconf -m prep SDfile
Find this compound or compounds like it in BindingDB:
Activity Spreadsheet -- Enzyme Inhibition Constant Data from BindingDB
Found 1 hit for monomerid = 50000726
TargetPlatelet-activating factor receptor(Cavia porcellus)
Abbott Laboratories
Curated by ChEMBL
LigandPNGBDBM50000726(4-{7-[4-(4-Fluoro-phenyl)-1-methyl-butyl]-5-hydrox...)
Affinity DataKi:  2.07E+4nM. Assay description: In vitro intrinsic binding affinity at platelet activating factor receptor using rabbit platelet membranes
In DepthDetails ArticlePubMed