BDBM50000739 CHEMBL307324::[8-(1H-Indol-3-ylmethyl)-11-isobutyl-14-isopropyl-12-methyl-4,7,10,13,16-pentaoxo-hexadecahydro-3a,6,9,12,15-pentaaza-cyclopentacyclopentadecen-5-yl]-acetic acid
SMILES CC(C)C[C@@H]1N(C)C(=O)[C@@H](NC(=O)[C@@H]2CCCN2C(=O)[C@H](CC(O)=O)NC(=O)[C@@H](Cc2c[nH]c3ccccc23)NC1=O)C(C)C
InChI Key InChIKey=DAFCCKSWJXSKCS-HOIWYFOJSA-N
Data  1 IC50
  Tab Delimited (TSV)   2D SDfile   Computed 3D by Vconf -m prep SDfile
Find this compound or compounds like it in BindingDB:
Activity Spreadsheet -- Enzyme Inhibition Constant Data from BindingDB
Found 1 hit for monomerid = 50000739
TargetEndothelin receptor type B(Homo sapiens (Human))
TBA
Curated by ChEMBL
LigandPNGBDBM50000739(CHEMBL307324 | [8-(1H-Indol-3-ylmethyl)-11-isobuty...)
Affinity DataIC50: >1.00E+5nM. Assay description: Binding activity against Endothelin B receptor 0f Porcine cerebellum membranes
In DepthDetails ArticlePubMed