BDBM50000768 CHEMBL50812
SMILES CC(C)C[C@H](NC(=O)[C@H](C)NC(=O)C[C@H](O)[C@H](CC(C)C)NC(=O)[C@@H](NC(=O)[C@@H](NC(=O)[C@H](C)O)C(C)C)C(C)C)[C@@H](O)CC(O)=O
InChI Key InChIKey=SGBATOYVQGIVGJ-VFGRQLJQSA-N
Data  1 KI
  Tab Delimited (TSV)   2D SDfile   Computed 3D by Vconf -m prep SDfile
Find this compound or compounds like it in BindingDB:
Activity Spreadsheet -- Enzyme Inhibition Constant Data from BindingDB
Found 1 hit for monomerid = 50000768
TargetGag-Pol polyprotein [489-587](Human immunodeficiency virus type 1)
Ciba-Geigy
Curated by ChEMBL
LigandPNGBDBM50000768(CHEMBL50812)
Affinity DataKi:  1.91E+4nM. Assay description: Binding affinity to HIV-1 proteaseChecked by Author
In DepthDetails ArticlePubMed