BDBM50000818 CHEMBL300452
SMILES CC(C)(C)OC(=O)N[C@H](Cc1ccccc1)[C@H](O)C(=O)N[C@@H](CCC(O)=O)C(=O)N[C@@H](Cc1ccccc1)C(O)=O
InChI Key InChIKey=HSKDHWLZKVSENR-KHUIQGCPSA-N
Data  1 KI
  Tab Delimited (TSV)   2D SDfile   Computed 3D by Vconf -m prep SDfile
Find this compound or compounds like it in BindingDB:
Activity Spreadsheet -- Enzyme Inhibition Constant Data from BindingDB
Found 1 hit for monomerid = 50000818
TargetGag-Pol polyprotein [489-587](Human immunodeficiency virus type 1)
Ciba-Geigy
Curated by ChEMBL
LigandPNGBDBM50000818(CHEMBL300452)
Affinity DataKi:  2.19E+4nM. Assay description: Binding affinity to HIV-1 proteaseChecked by Author
In DepthDetails ArticlePubMed