BDBM50000849 6-[3-Fluoro-5-(4-methoxy-tetrahydro-pyran-4-yl)-phenoxymethyl]-1-methyl-1H-quinolin-4-one (0.2 hydrate)::CHEMBL88724
SMILES COC1(CCOCC1)c1cc(F)cc(OCc2ccc3n(C)ccc(=O)c3c2)c1
InChI Key InChIKey=VOEFQHBPNGUXJO-UHFFFAOYSA-N
Data  1 IC50
  Tab Delimited (TSV)   2D SDfile   Computed 3D by Vconf -m prep SDfile
Find this compound or compounds like it in BindingDB:
Activity Spreadsheet -- Enzyme Inhibition Constant Data from BindingDB
Found 1 hit for monomerid = 50000849
TargetPolyunsaturated fatty acid 5-lipoxygenase(Homo sapiens (Human))
Ici Pharmaceuticals Group
Curated by ChEMBL
LigandPNGBDBM50000849(6-[3-Fluoro-5-(4-methoxy-tetrahydro-pyran-4-yl)-ph...)
Affinity DataIC50:  3.00E+4nM. Assay description: In vitro inhibition of leukotriene B4 synthesis in human whole blood by inhibiting 5-lipoxygenase
In DepthDetails ArticlePubMed