BDBM50000883 1-Methyl-7-(4-oxo-4-piperidin-1-yl-butoxy)-1,3-dihydro-imidazo[4,5-b]quinolin-2-one::CHEMBL313282
SMILES Cn1c2cc3cc(OCCCC(=O)N4CCCCC4)ccc3nc2[nH]c1=O
InChI Key InChIKey=NEXQSNFNHKOAMU-UHFFFAOYSA-N
Data  2 IC50  1 EC50
  Tab Delimited (TSV)   2D SDfile   Computed 3D by Vconf -m prep SDfile
Find this compound or compounds like it in BindingDB:
Activity Spreadsheet -- Enzyme Inhibition Constant Data from BindingDB
Found 3 hits for monomerid = 50000883
TargetP2Y purinoceptor 12(Homo sapiens (Human))
Bristol-Myers Squibb Pharmaceutical Research Institute
Curated by ChEMBL
LigandPNGBDBM50000883(1-Methyl-7-(4-oxo-4-piperidin-1-yl-butoxy)-1,3-dih...)
Affinity DataEC50:  1.09E+4nM. Assay description: Inhibition of platelet aggregation using Adenosine diphosphate (ADP) as activating agent in rabbit platelet rich plasma (PRP)
In DepthDetails ArticlePubMed
TargetcGMP-inhibited 3',5'-cyclic phosphodiesterase 3A/3B(Homo sapiens (Human))
Bristol-Myers Squibb Pharmaceutical Research Institute
Curated by ChEMBL
LigandPNGBDBM50000883(1-Methyl-7-(4-oxo-4-piperidin-1-yl-butoxy)-1,3-dih...)
Affinity DataIC50:  2.00E+3nM. Assay description: Inhibition of human platelet PDE by inhibiting cyclic Adenosine monophosphate (cAMP) hydrolysis
In DepthDetails ArticlePubMed
TargetcGMP-dependent 3',5'-cyclic phosphodiesterase(Homo sapiens (Human))
Bristol-Myers Squibb Pharmaceutical Research Institute
Curated by ChEMBL
LigandPNGBDBM50000883(1-Methyl-7-(4-oxo-4-piperidin-1-yl-butoxy)-1,3-dih...)
Affinity DataIC50:  6.00E+4nM. Assay description: Inhibition of human platelet PDE by inhibiting cyclic Guanosine monophosphate (cGMP) hydrolysis
In DepthDetails ArticlePubMed