BDBM50000886 4-(2-Oxo-2,3-dihydro-1H-imidazo[4,5-b]quinolin-7-yloxy)-butyric acid::CHEMBL313463
SMILES OC(=O)CCCOc1ccc2nc3[nH]c(=O)[nH]c3cc2c1
InChI Key InChIKey=XNHZEJRZFBXTOB-UHFFFAOYSA-N
Data  2 IC50  2 EC50
  Tab Delimited (TSV)   2D SDfile   Computed 3D by Vconf -m prep SDfile
Find this compound or compounds like it in BindingDB:
Activity Spreadsheet -- Enzyme Inhibition Constant Data from BindingDB
Found 4 hits for monomerid = 50000886
TargetcGMP-dependent 3',5'-cyclic phosphodiesterase(Homo sapiens (Human))
Bristol-Myers Squibb Pharmaceutical Research Institute
Curated by ChEMBL
LigandPNGBDBM50000886(4-(2-Oxo-2,3-dihydro-1H-imidazo[4,5-b]quinolin-7-y...)
Affinity DataIC50:  3.00E+4nM. Assay description: Inhibition of human platelet PDE by inhibiting cyclic Guanosine monophosphate (cGMP) hydrolysis
In DepthDetails ArticlePubMed
TargetcGMP-inhibited 3',5'-cyclic phosphodiesterase 3A/3B(Homo sapiens (Human))
Bristol-Myers Squibb Pharmaceutical Research Institute
Curated by ChEMBL
LigandPNGBDBM50000886(4-(2-Oxo-2,3-dihydro-1H-imidazo[4,5-b]quinolin-7-y...)
Affinity DataIC50:  5nM. Assay description: Inhibition of human platelet PDE by inhibiting cyclic Adenosine monophosphate (cAMP) hydrolysis
In DepthDetails ArticlePubMed
TargetP2Y purinoceptor 12(Homo sapiens (Human))
Bristol-Myers Squibb Pharmaceutical Research Institute
Curated by ChEMBL
LigandPNGBDBM50000886(4-(2-Oxo-2,3-dihydro-1H-imidazo[4,5-b]quinolin-7-y...)
Affinity DataEC50:  1.04E+3nM. Assay description: Inhibition of platelet aggregation using adenosine diphosphate (ADP) as activating agent in human platelet rich plasma (PRP)
In DepthDetails ArticlePubMed
TargetP2Y purinoceptor 12(Homo sapiens (Human))
Bristol-Myers Squibb Pharmaceutical Research Institute
Curated by ChEMBL
LigandPNGBDBM50000886(4-(2-Oxo-2,3-dihydro-1H-imidazo[4,5-b]quinolin-7-y...)
Affinity DataEC50:  1.04E+3nM. Assay description: Inhibition of platelet aggregation using Adenosine diphosphate (ADP) as activating agent in rabbit platelet rich plasma (PRP)
In DepthDetails ArticlePubMed