BDBM50000921 5-(2-Oxo-2,3-dihydro-1H-imidazo[4,5-b]quinolin-7-yl)-pentanoic acid methyl ester::CHEMBL420980
SMILES COC(=O)CCCCc1ccc2nc3[nH]c(=O)[nH]c3cc2c1
InChI Key InChIKey=CDYDGQKJBVWOML-UHFFFAOYSA-N
Data  1 IC50  2 EC50
  Tab Delimited (TSV)   2D SDfile   Computed 3D by Vconf -m prep SDfile
Find this compound or compounds like it in BindingDB:
Activity Spreadsheet -- Enzyme Inhibition Constant Data from BindingDB
Found 3 hits for monomerid = 50000921
TargetP2Y purinoceptor 12(Homo sapiens (Human))
Bristol-Myers Squibb Pharmaceutical Research Institute
Curated by ChEMBL
LigandPNGBDBM50000921(5-(2-Oxo-2,3-dihydro-1H-imidazo[4,5-b]quinolin-7-y...)
Affinity DataEC50:  3.00E+3nM. Assay description: Inhibition of platelet aggregation using adenosine diphosphate (ADP) as activating agent in human platelet rich plasma (PRP)
In DepthDetails ArticlePubMed
TargetP2Y purinoceptor 12(Homo sapiens (Human))
Bristol-Myers Squibb Pharmaceutical Research Institute
Curated by ChEMBL
LigandPNGBDBM50000921(5-(2-Oxo-2,3-dihydro-1H-imidazo[4,5-b]quinolin-7-y...)
Affinity DataEC50:  430nM. Assay description: Inhibition of platelet aggregation using Adenosine diphosphate (ADP) as activating agent in rabbit platelet rich plasma (PRP)
In DepthDetails ArticlePubMed
TargetcGMP-inhibited 3',5'-cyclic phosphodiesterase 3A/3B(Homo sapiens (Human))
Bristol-Myers Squibb Pharmaceutical Research Institute
Curated by ChEMBL
LigandPNGBDBM50000921(5-(2-Oxo-2,3-dihydro-1H-imidazo[4,5-b]quinolin-7-y...)
Affinity DataIC50:  900nM. Assay description: Inhibition of platelet aggregation using Adenosine diphosphate (ADP) as activating agent in rabbit platelet rich plasma (PRP)
In DepthDetails ArticlePubMed