BDBM50000924 4-(1,3-Dimethyl-2-oxo-2,3-dihydro-1H-imidazo[4,5-b]quinolin-7-yloxy)-butyric acid methyl ester(HCl)::CHEMBL90102
SMILES COC(=O)CCCOc1ccc2nc3n(C)c(=O)n(C)c3cc2c1
InChI Key InChIKey=FLGWVWFWLUEOAA-UHFFFAOYSA-N
Data  1 IC50  1 EC50
  Tab Delimited (TSV)   2D SDfile   Computed 3D by Vconf -m prep SDfile
Find this compound or compounds like it in BindingDB:
Activity Spreadsheet -- Enzyme Inhibition Constant Data from BindingDB
Found 2 hits for monomerid = 50000924
TargetP2Y purinoceptor 12(Homo sapiens (Human))
Bristol-Myers Squibb Pharmaceutical Research Institute
Curated by ChEMBL
LigandPNGBDBM50000924(4-(1,3-Dimethyl-2-oxo-2,3-dihydro-1H-imidazo[4,5-b...)
Affinity DataEC50: >8.75E+4nM. Assay description: Inhibition of platelet aggregation using Adenosine diphosphate (ADP) as activating agent in rabbit platelet rich plasma (PRP)
In DepthDetails ArticlePubMed
TargetcGMP-inhibited 3',5'-cyclic phosphodiesterase 3A/3B(Homo sapiens (Human))
Bristol-Myers Squibb Pharmaceutical Research Institute
Curated by ChEMBL
LigandPNGBDBM50000924(4-(1,3-Dimethyl-2-oxo-2,3-dihydro-1H-imidazo[4,5-b...)
Affinity DataIC50:  4.00E+4nM. Assay description: Inhibition of platelet aggregation using adenosine diphosphate (ADP) as activating agent in human platelet rich plasma (PRP)
In DepthDetails ArticlePubMed