BDBM50001165 2,2-Dimethyl-7-[5-phenyl-3-(3-phenyl-propyl)-thiophen-2-yl]-heptanoic acid::CHEMBL430520
SMILES CC(C)(CCCCCc1sc(cc1CCCc1ccccc1)-c1ccccc1)C(O)=O
InChI Key InChIKey=KCPVSOFACKEMON-UHFFFAOYSA-N
Data  1 IC50
  Tab Delimited (TSV)   2D SDfile   Computed 3D by Vconf -m prep SDfile
Find this compound or compounds like it in BindingDB:
Activity Spreadsheet -- Enzyme Inhibition Constant Data from BindingDB
Found 1 hit for monomerid = 50001165
TargetLeukotriene B4 receptor 1(Homo sapiens (Human))
Centre De Recherche De Vitry-Alfortville
Curated by ChEMBL
LigandPNGBDBM50001165(2,2-Dimethyl-7-[5-phenyl-3-(3-phenyl-propyl)-thiop...)
Affinity DataIC50:  800nM. Assay description: Capability to inhibit the binding of [3H]-LTB4 to guinea pig spleen Leukotriene B4 receptor at the concentration of 10e-5 M
In DepthDetails ArticlePubMed