BDBM50001313 18-(4-Amino-butyl)-15-benzyl-3-sec-butyl-16-methyl-6-naphthalen-2-ylmethyl-1,4,7,13,16,19-hexaaza-tricyclo[19.4.0.0*9,13*]pentacosane-2,5,8,14,17,20-hexaone::CHEMBL338018
SMILES CC[C@H](C)[C@@H]1NC(=O)[C@@H](Cc2ccc3ccccc3c2)NC(=O)[C@@H]2CCCN2C(=O)[C@@H](Cc2ccccc2)N(C)C(=O)[C@H](CCCCN)NC(=O)[C@H]2CCCCN2C1=O
InChI Key InChIKey=ASIBWWHGDICUFM-IVDQXPDGSA-N
Data  3 IC50
  Tab Delimited (TSV)   2D SDfile   Computed 3D by Vconf -m prep SDfile
Find this compound or compounds like it in BindingDB:
Activity Spreadsheet -- Enzyme Inhibition Constant Data from BindingDB
Found 3 hits for monomerid = 50001313
TargetOxytocin receptor(RAT)
Merck Research Laboratories
Curated by ChEMBL
LigandPNGBDBM50001313(18-(4-Amino-butyl)-15-benzyl-3-sec-butyl-16-methyl...)
Affinity DataIC50:  13nM. Assay description: Concentration required to displace 50% of [3H]oxytocin from rat uterine receptor.
In DepthDetails ArticlePubMed
TargetVasopressin V2 receptor(Rattus norvegicus (Rat))
Merck Research Laboratories
Curated by ChEMBL
LigandPNGBDBM50001313(18-(4-Amino-butyl)-15-benzyl-3-sec-butyl-16-methyl...)
Affinity DataIC50:  110nM. Assay description: Inhibition of [3H]arginine vasopressin binding to AVP-V2 site in rat kidney medulla.
In DepthDetails ArticlePubMed
TargetVasopressin V1a receptor(RAT)
Merck Research Laboratories
Curated by ChEMBL
LigandPNGBDBM50001313(18-(4-Amino-butyl)-15-benzyl-3-sec-butyl-16-methyl...)
Affinity DataIC50:  1.30E+3nM. Assay description: Concentration required to displace 50% of [3H]arginine vasopressin from rat liver arginine vasopressin 1A (AVP-V1a) site.
In DepthDetails ArticlePubMed