BDBM50001454 3-Amino-N-{1-[1-(1-{[(1-{[(1-carbamoyl-3-methyl-butyl)-propyl-amino]-methyl}-3-methyl-butylcarbamoyl)-methyl]-carbamoyl}-2-methyl-propylcarbamoyl)-2-phenyl-ethylcarbamoyl]-2-hydroxy-ethyl}-succinamic acid::CHEMBL128854
SMILES CCCN(C[C@H](CC(C)C)NC(=O)CNC(=O)[C@@H](NC(=O)[C@H](Cc1ccccc1)NC(=O)[C@H](CO)NC(=O)[C@@H](N)CC(O)=O)C(C)C)[C@@H](CC(C)C)C(N)=O
InChI Key InChIKey=BJJQIDLSWPHFTF-HLYNNXGTSA-N
Data  1 IC50
  Tab Delimited (TSV)   2D SDfile   Computed 3D by Vconf -m prep SDfile
Find this compound or compounds like it in BindingDB:
Activity Spreadsheet -- Enzyme Inhibition Constant Data from BindingDB
Found 1 hit for monomerid = 50001454
TargetSubstance-K receptor(HAMSTER)
Marion Merrell Dow Research Institute
Curated by ChEMBL
LigandPNGBDBM50001454(3-Amino-N-{1-[1-(1-{[(1-{[(1-carbamoyl-3-methyl-bu...)
Affinity DataIC50:  103nM. Assay description: Competitive inhibition of [125I]NKA binding to hamster urinary bladder Tachykinin receptor 2
In DepthDetails ArticlePubMed