BDBM50001565 CHEMBL275251
SMILES [H][C@@]12[C@@H](C)C(=O)[C@H](C)C[C@](C)(OC)[C@H](OC3O[C@H](C)C[C@@H]([C@H]3O)N(C)C(C)C)[C@@H](C)[C@H](OC(=O)N3CCOCC3)[C@@H](C)C(=O)O[C@H](CC)[C@@]1(C)OC(=O)N2CCc1ccc(Cl)cc1
InChI Key InChIKey=XDIZKFSMPUGKFY-GRGHQODPSA-N
Data  2 KI
  Tab Delimited (TSV)   2D SDfile   Computed 3D by Vconf -m prep SDfile
Find this compound or compounds like it in BindingDB:
Activity Spreadsheet -- Enzyme Inhibition Constant Data from BindingDB
Found 2 hits for monomerid = 50001565
TargetGonadotropin-releasing hormone receptor(Rattus norvegicus)
Abbott Laboratories
Curated by ChEMBL
LigandPNGBDBM50001565(CHEMBL275251)
Affinity DataKi:  427nM. Assay description: In vitro binding affinity to rat luteinizing hormone-releasing hormone (LHRH) receptor cloned in CHO cellsChecked by Author
In DepthDetails ArticlePubMed
TargetGonadotropin-releasing hormone receptor(Homo sapiens (Human))
Abbott Laboratories
Curated by ChEMBL
LigandPNGBDBM50001565(CHEMBL275251)
Affinity DataKi:  5.62E+3nM. Assay description: In vitro binding affinity to human luteinizing hormone-releasing hormone (LHRH) receptor cloned in CHO cellsChecked by Author
In DepthDetails ArticlePubMed